# Upgrade Bloomreach from 14.7.3 tp 15.1.3

**URL:** <https://community.bloomreach.com/t/upgrade-bloomreach-from-14-7-3-tp-15-1-3/3491>\
**Category:** Uncategorized\
**Created:** [November 22, 2022, 4:52am UTC](https://community.bloomreach.com/t/upgrade-bloomreach-from-14-7-3-tp-15-1-3/3491 "2022-11-22T04:52:41Z")\
**Posts on this page:** 2\
**Page:** 1

<div class="post-metadata">

**Author:** ![uma027](https://avatars.discourse-cdn.com/v4/letter/u/e0b2c6/32.png) [@uma027](https://community.bloomreach.com/u/uma027)\
**Post date:** [November 22, 2022, 4:52am UTC](https://community.bloomreach.com/t/upgrade-bloomreach-from-14-7-3-tp-15-1-3/3491/1 "2022-11-22T04:52:41Z")

</div>

Upgrading Bloomreach from 14.7.3 to 15.1.3. Adding the dependencies as stated in [Upgrade to Java 11 - Bloomreach Experience Manager (PaaS/Self-Hosted) - The Fast and Flexible Headless CMS](https://xmdocumentation.bloomreach.com/library/upgrade-14-to-15/steps/upgrade-to-java-11.html) gives below error when I run mvn -Pcargo.run -X

DEBUG] (s) groupId = jakarta.xml.bind  
[DEBUG] (s) artifactId = jakarta.xml.bind-api  
[INFO] ------------------------------------------------------------------------  
[INFO] BUILD FAILURE  
[INFO] ------------------------------------------------------------------------  
[INFO] Total time: 0.587 s  
[INFO] Finished at: 2022-11-21T22:15:28-06:00  
[INFO] ------------------------------------------------------------------------  
[ERROR] Failed to execute goal org.codehaus.cargo:cargo-maven2-plugin:1.7.15:start (cargo-run) on project dx-cms: Unable to parse configuration of mojo org.codehaus.cargo:cargo-maven2-plugin:1.7.15:start for parameter scope: Cannot find ‘scope’ in class org.codehaus.cargo.maven2.configuration.Dependency → [Help 1]  
org.apache.maven.lifecycle.LifecycleExecutionException: Failed to execute goal org.codehaus.cargo:cargo-maven2-plugin:1.7.15:start (cargo-run) on project dx-cms: Unable to parse configuration of mojo org.codehaus.cargo:cargo-maven2-plugin:1.7.15:start for parameter scope: Cannot find ‘scope’ in class org.codehaus.cargo.maven2.configuration.Dependency

If I remove those dependencies, I do not see the error . Could you please help me if we need these dependencies to be added

---

<div class="post-metadata">

**Author:** ![jasper.floor](https://yyz1.discourse-cdn.com/flex027/user_avatar/community.bloomreach.com/jasper.floor/32/28_2.png) [@jasper.floor](https://community.bloomreach.com/u/jasper.floor)\
**Post date:** [November 22, 2022, 12:48pm UTC](https://community.bloomreach.com/t/upgrade-bloomreach-from-14-7-3-tp-15-1-3/3491/2 "2022-11-22T12:48:46Z")

</div>

You probably have an error in the xml. Maybe you added the dependencies on the wrong level. I do think you will need them.
